Target
Alkaline phosphatase, tissue-nonspecific isozyme
Ligand
BDBM43818
Substrate
Meas. Tech.
uHTS identification of compounds activating TNAP in the absence of phosphate acceptor performed in luminescent assay
EC50
5144.5±n/a nM
Citation
 PubChem, PC uHTS identification of compounds activating TNAP in the absence of phosphate acceptor performed in luminescent assay PubChem Bioassay (2009)[AID] 
Target
Name:
Alkaline phosphatase, tissue-nonspecific isozyme
Synonyms:
ALPL tissue-nonspecific alkaline phosphatase precursor
Type:
PROTEIN
Mol. Mass.:
57306.17
Organism:
Homo sapiens (Human)
Description:
ChEMBL_1448917
Residue:
524
  
Inhibitor
Name:
BDBM43818
Synonyms:
(2Z)-3-ethyl-2-[(E)-3-(3-ethyl-5-phenyl-1,3-benzoxazol-3-ium-2-yl)prop-2-enylidene]-5-phenyl-1,3-benzoxazole;ethyl sulfate cid_10864994
Type:
Small organic molecule
Emp. Form.:
C33H29N2O2
Mol. Mass.:
485.595
SMILES:
CCN1\C(Oc2ccc(cc12)-c1ccccc1)=C\C=C\c1oc2ccc(cc2[n+]1CC)-c1ccccc1
: