Target
Alkaline phosphatase, tissue-nonspecific isozyme
Ligand
BDBM59319
Substrate
Meas. Tech.
uHTS identification of compounds activating TNAP in the absence of phosphate acceptor performed in luminescent assay
EC50
100000±n/a nM
Citation
 PubChem, PC uHTS identification of compounds activating TNAP in the absence of phosphate acceptor performed in luminescent assay PubChem Bioassay (2009)[AID] 
Target
Name:
Alkaline phosphatase, tissue-nonspecific isozyme
Synonyms:
ALPL tissue-nonspecific alkaline phosphatase precursor
Type:
PROTEIN
Mol. Mass.:
57306.17
Organism:
Homo sapiens (Human)
Description:
ChEMBL_1448917
Residue:
524
  
Inhibitor
Name:
BDBM59319
Synonyms:
(2-methoxy-4-morpholin-4-ylcarbothioyl-phenyl) (E)-3-(furan-2-yl)prop-2-enoate (E)-3-(2-furyl)acrylic acid [2-methoxy-4-(morpholine-4-carbothioyl)phenyl] ester MLS000728095 [2-methoxy-4-(morpholine-4-carbothioyl)phenyl] (E)-3-(furan-2-yl)prop-2-enoate | cid_1514461
Type:
Small organic molecule
Emp. Form.:
C19H19NO5S
Mol. Mass.:
373.423
SMILES:
COc1cc(ccc1OC(=O)\C=C\c1ccco1)C(=S)N1CCOCC1
: