Target
Alkaline phosphatase, tissue-nonspecific isozyme
Ligand
BDBM59324
Substrate
Meas. Tech.
uHTS identification of compounds activating TNAP in the absence of phosphate acceptor performed in luminescent assay
EC50
63225±n/a nM
Citation
 PubChem, PC uHTS identification of compounds activating TNAP in the absence of phosphate acceptor performed in luminescent assay PubChem Bioassay (2009)[AID] 
Target
Name:
Alkaline phosphatase, tissue-nonspecific isozyme
Synonyms:
ALPL tissue-nonspecific alkaline phosphatase precursor
Type:
PROTEIN
Mol. Mass.:
57306.17
Organism:
Homo sapiens (Human)
Description:
ChEMBL_1448917
Residue:
524
  
Inhibitor
Name:
BDBM59324
Synonyms:
MLS000622043 N'-[1-(5-chloranyl-2-methyl-phenyl)pyrazolo[3,4-d]pyrimidin-4-yl]furan-2-carbohydrazide N'-[1-(5-chloro-2-methylphenyl)-4-pyrazolo[3,4-d]pyrimidinyl]-2-furancarbohydrazide SMR000310970 | cid_16194312
Type:
Small organic molecule
Emp. Form.:
C17H13ClN6O2
Mol. Mass.:
368.777
SMILES:
Cc1ccc(Cl)cc1-n1ncc2c(NNC(=O)c3ccco3)ncnc12
: