Target
Alkaline phosphatase, tissue-nonspecific isozyme
Ligand
BDBM59333
Substrate
Meas. Tech.
uHTS identification of compounds activating TNAP in the absence of phosphate acceptor performed in luminescent assay
EC50
100000±n/a nM
Citation
 PubChem, PC uHTS identification of compounds activating TNAP in the absence of phosphate acceptor performed in luminescent assay PubChem Bioassay (2009)[AID] 
Target
Name:
Alkaline phosphatase, tissue-nonspecific isozyme
Synonyms:
ALPL tissue-nonspecific alkaline phosphatase precursor
Type:
PROTEIN
Mol. Mass.:
57306.17
Organism:
Homo sapiens (Human)
Description:
ChEMBL_1448917
Residue:
524
  
Inhibitor
Name:
BDBM59333
Synonyms:
1-benzyl-5-keto-pyrrolidine-3-carboxylic acid [2-(4-chloro-2-fluoro-anilino)-2-keto-ethyl] ester MLS000770811 [2-(4-chloro-2-fluoroanilino)-2-oxoethyl] 1-benzyl-5-oxopyrrolidine-3-carboxylate cid_5191970
Type:
Small organic molecule
Emp. Form.:
C20H18ClFN2O4
Mol. Mass.:
404.819
SMILES:
Fc1cc(Cl)ccc1NC(=O)COC(=O)C1CN(Cc2ccccc2)C(=O)C1
: