Target
E3 ubiquitin-protein ligase XIAP
Ligand
BDBM59369
Substrate
Meas. Tech.
Chemical Antagonists IAP-family anti-apoptotic proteins
IC50
100000±n/a nM
Citation
 PubChem, PC Chemical Antagonists IAP-family anti-apoptotic proteins PubChem Bioassay (2008)[AID] 
Target
Name:
E3 ubiquitin-protein ligase XIAP
Synonyms:
API3 E3 ubiquitin-protein ligase XIAP Inhibitor of apoptosis protein 3 X-linked inhibitor of apoptosis XIAP | XIAP_HUMAN
Type:
Protein
Mol. Mass.:
56685.27
Organism:
Homo sapiens (Human)
Description:
P98170
Residue:
497
  
Inhibitor
Name:
BDBM59369
Synonyms:
2-[(4-piperidin-1-ylcarbonylphenyl)carbamoyl]bicyclo[2.2.1]hept-5-ene-3-carboxylic acid 2-[oxo-[4-[oxo(1-piperidinyl)methyl]anilino]methyl]-3-bicyclo[2.2.1]hept-5-enecarboxylic acid MLS000062499 cid_2942023
Type:
Small organic molecule
Emp. Form.:
C21H24N2O4
Mol. Mass.:
368.4263
SMILES:
[H]C12CC([H])(C=C1)C(C2C(O)=O)C(=O)Nc1ccc(cc1)C(=O)N1CCCCC1
: