Target
E3 ubiquitin-protein ligase XIAP
Ligand
BDBM59373
Substrate
Meas. Tech.
Chemical Antagonists IAP-family anti-apoptotic proteins
IC50
100000±n/a nM
Citation
 PubChem, PC Chemical Antagonists IAP-family anti-apoptotic proteins PubChem Bioassay (2008)[AID] 
Target
Name:
E3 ubiquitin-protein ligase XIAP
Synonyms:
API3 E3 ubiquitin-protein ligase XIAP Inhibitor of apoptosis protein 3 X-linked inhibitor of apoptosis XIAP | XIAP_HUMAN
Type:
Protein
Mol. Mass.:
56685.27
Organism:
Homo sapiens (Human)
Description:
P98170
Residue:
497
  
Inhibitor
Name:
BDBM59373
Synonyms:
3-amino-4-(cyclohexylamino)-1-benzopyran-2-one 3-amino-4-(cyclohexylamino)chromen-2-one 3-azanyl-4-(cyclohexylamino)chromen-2-one SMR000069478 | cid_50494
Type:
Small organic molecule
Emp. Form.:
C15H18N2O2
Mol. Mass.:
258.3156
SMILES:
Nc1c(NC2CCCCC2)c2ccccc2oc1=O
: