Target
E3 ubiquitin-protein ligase XIAP
Ligand
BDBM56590
Substrate
Meas. Tech.
Chemical Antagonists IAP-family anti-apoptotic proteins
IC50
100000±n/a nM
Citation
 PubChem, PC Chemical Antagonists IAP-family anti-apoptotic proteins PubChem Bioassay (2008)[AID] 
Target
Name:
E3 ubiquitin-protein ligase XIAP
Synonyms:
API3 E3 ubiquitin-protein ligase XIAP Inhibitor of apoptosis protein 3 X-linked inhibitor of apoptosis XIAP | XIAP_HUMAN
Type:
Protein
Mol. Mass.:
56685.27
Organism:
Homo sapiens (Human)
Description:
P98170
Residue:
497
  
Inhibitor
Name:
BDBM56590
Synonyms:
2-[(5Z)-5-[2-(4-chloroanilino)-2-keto-ethylidene]-2,4-diketo-thiazolidin-3-yl]-N-(p-tolyl)acetamide 2-[(5Z)-5-[2-(4-chloroanilino)-2-oxoethylidene]-2,4-dioxo-3-thiazolidinyl]-N-(4-methylphenyl)acetamide MLS000418815 cid_2151852
Type:
Small organic molecule
Emp. Form.:
C20H16ClN3O4S
Mol. Mass.:
429.877
SMILES:
Cc1ccc(NC(=O)CN2C(=O)S\C(=C/C(=O)Nc3ccc(Cl)cc3)C2=O)cc1
: