Target
Nucleotide-binding oligomerization domain-containing protein 1
Ligand
BDBM54389
Substrate
Meas. Tech.
uHTS luminescence assay for the identification of compounds that inhibit NOD1
EC50
3140±n/a nM
Citation
 PubChem, PC uHTS luminescence assay for the identification of compounds that inhibit NOD1 PubChem Bioassay (2010)[AID] 
Target
Name:
Nucleotide-binding oligomerization domain-containing protein 1
Synonyms:
CARD4 NOD1_HUMAN | nucleotide-binding oligomerization domain containing 1
Type:
Enzyme Catalytic Domain
Mol. Mass.:
107699.03
Organism:
Homo sapiens (Human)
Description:
gi_5174617
Residue:
953
  
Inhibitor
Name:
BDBM54389
Synonyms:
4-(3,4-dihydro-1H-isoquinolin-2-yl)-8-fluoranyl-5H-pyrimido[5,4-b]indole 4-(3,4-dihydro-1H-isoquinolin-2-yl)-8-fluoro-5H-pyrimido[5,4-b]indole SMR000431674 | cid_920148
Type:
Small organic molecule
Emp. Form.:
C19H15FN4
Mol. Mass.:
318.3476
SMILES:
Fc1ccc2[nH]c3c(ncnc3c2c1)N1CCc2ccccc2C1
: