Target
Nucleotide-binding oligomerization domain-containing protein 1
Ligand
BDBM54456
Substrate
Meas. Tech.
uHTS luminescence assay for the identification of compounds that inhibit NOD1
EC50
1690±n/a nM
Citation
 PubChem, PC uHTS luminescence assay for the identification of compounds that inhibit NOD1 PubChem Bioassay (2010)[AID] 
Target
Name:
Nucleotide-binding oligomerization domain-containing protein 1
Synonyms:
CARD4 NOD1_HUMAN | nucleotide-binding oligomerization domain containing 1
Type:
Enzyme Catalytic Domain
Mol. Mass.:
107699.03
Organism:
Homo sapiens (Human)
Description:
gi_5174617
Residue:
953
  
Inhibitor
Name:
BDBM54456
Synonyms:
MLS001172367 N-[(2-methoxyphenyl)methyl]thieno[2,3-d]pyrimidin-4-amine cid_2443590 | o-anisyl(thieno[2,3-d]pyrimidin-4-yl)amine
Type:
Small organic molecule
Emp. Form.:
C14H13N3OS
Mol. Mass.:
271.338
SMILES:
COc1ccccc1CNc1ncnc2sccc12
: