Target
M17 leucyl aminopeptidase
Ligand
BDBM59651
Substrate
Meas. Tech.
Inhibitors of Plasmodium falciparum M17- Family Leucine Aminopeptidase (M17LAP)
IC50
1390±n/a nM
Citation
 PubChem, PC Inhibitors of Plasmodium falciparum M17- Family Leucine Aminopeptidase (M17LAP) PubChem Bioassay (2009)[AID] 
Target
Name:
M17 leucyl aminopeptidase
Synonyms:
leucine aminopeptidase
Type:
Enzyme Catalytic Domain
Mol. Mass.:
67834.32
Organism:
Plasmodium falciparum 3D7
Description:
gi_124809582
Residue:
605
  
Inhibitor
Name:
BDBM59651
Synonyms:
6-({[4-(2-furyl)-3-(methoxycarbonyl)thien-2-yl]amino}carbonyl)cyclohex-3-ene-1-carboxylic acid 6-[[4-(furan-2-yl)-3-methoxycarbonyl-thiophen-2-yl]carbamoyl]cyclohex-3-ene-1-carboxylic acid 6-[[[4-(2-furanyl)-3-methoxycarbonyl-2-thiophenyl]amino]-oxomethyl]-1-cyclohex-3-enecarboxylic acid SMR000020266 | cid_3235678
Type:
Small organic molecule
Emp. Form.:
C18H17NO6S
Mol. Mass.:
375.396
SMILES:
COC(=O)c1c(NC(=O)C2CC=CCC2C(O)=O)scc1-c1ccco1
: