Target
M17 leucyl aminopeptidase
Ligand
BDBM59701
Substrate
Meas. Tech.
Inhibitors of Plasmodium falciparum M17- Family Leucine Aminopeptidase (M17LAP)
IC50
1000±n/a nM
Citation
 PubChem, PC Inhibitors of Plasmodium falciparum M17- Family Leucine Aminopeptidase (M17LAP) PubChem Bioassay (2009)[AID] 
Target
Name:
M17 leucyl aminopeptidase
Synonyms:
leucine aminopeptidase
Type:
Enzyme Catalytic Domain
Mol. Mass.:
67834.32
Organism:
Plasmodium falciparum 3D7
Description:
gi_124809582
Residue:
605
  
Inhibitor
Name:
BDBM59701
Synonyms:
3-(3,4-dichlorophenyl)-1H-pyrazol-5-ol 5-(3,4-dichlorophenyl)-3-pyrazolin-3-one MLS000066902 cid_598633
Type:
Small organic molecule
Emp. Form.:
C9H6Cl2N2O
Mol. Mass.:
229.063
SMILES:
Clc1ccc(cc1Cl)-c1cc(=O)[nH][nH]1
: