Target
M17 leucyl aminopeptidase
Ligand
BDBM53878
Substrate
Meas. Tech.
Inhibitors of Plasmodium falciparum M17- Family Leucine Aminopeptidase (M17LAP)
IC50
1000±n/a nM
Citation
 PubChem, PC Inhibitors of Plasmodium falciparum M17- Family Leucine Aminopeptidase (M17LAP) PubChem Bioassay (2009)[AID] 
Target
Name:
M17 leucyl aminopeptidase
Synonyms:
leucine aminopeptidase
Type:
Enzyme Catalytic Domain
Mol. Mass.:
67834.32
Organism:
Plasmodium falciparum 3D7
Description:
gi_124809582
Residue:
605
  
Inhibitor
Name:
BDBM53878
Synonyms:
4,5-dimethoxy-2-[2-(5-phenylthieno[2,3-d]pyrimidin-4-yl)sulfanylethanoylamino]benzoic acid 4,5-dimethoxy-2-[[2-(5-phenylthieno[2,3-d]pyrimidin-4-yl)sulfanylacetyl]amino]benzoic acid MLS000856474 cid_3186974
Type:
Small organic molecule
Emp. Form.:
C23H19N3O5S2
Mol. Mass.:
481.544
SMILES:
COc1cc(NC(=O)CSc2ncnc3scc(-c4ccccc4)c23)c(cc1OC)C(O)=O
: