Target
Dual specificity protein phosphatase 3
Ligand
BDBM46223
Substrate
Meas. Tech.
uHTS absorbance assay for the identification of compounds that inhibit VHR1.
IC50
1680±n/a nM
Citation
 PubChem, PC uHTS absorbance assay for the identification of compounds that inhibit VHR1. PubChem Bioassay (2009)[AID] 
Target
Name:
Dual specificity protein phosphatase 3
Synonyms:
DUS3_HUMAN Dual specificity protein phosphatase (VHR) Dual specificity protein phosphatase VHR Tyrosine-protein phosphatase non-receptor type 1 | VHR
Type:
Hydrolase
Mol. Mass.:
20480.58
Organism:
Homo sapiens (Human)
Description:
Residue:
185
  
Inhibitor
Name:
BDBM46223
Synonyms:
(4Z)-2-methoxy-4-[piperidin-1-yl(sulfanyl)methylidene]cyclohexa-2,5-dien-1-one (4Z)-4-[mercapto(piperidino)methylene]-2-methoxy-cyclohexa-2,5-dien-1-one cid_5336454
Type:
Small organic molecule
Emp. Form.:
C13H17NO2S
Mol. Mass.:
251.345
SMILES:
COc1cc(ccc1O)C(=S)N1CCCCC1
: