Target
Dual specificity protein phosphatase 3
Ligand
BDBM51764
Substrate
Meas. Tech.
uHTS absorbance assay for the identification of compounds that inhibit VHR1.
IC50
1150±n/a nM
Citation
 PubChem, PC uHTS absorbance assay for the identification of compounds that inhibit VHR1. PubChem Bioassay (2009)[AID] 
Target
Name:
Dual specificity protein phosphatase 3
Synonyms:
DUS3_HUMAN Dual specificity protein phosphatase (VHR) Dual specificity protein phosphatase VHR Tyrosine-protein phosphatase non-receptor type 1 | VHR
Type:
Hydrolase
Mol. Mass.:
20480.58
Organism:
Homo sapiens (Human)
Description:
Residue:
185
  
Inhibitor
Name:
BDBM51764
Synonyms:
4-cyano-3-methyl-5-[(2-phenylquinoline-4-carbonyl)amino]thiophene-2-carboxylic acid methyl ester MLS000324652 cid_1009439 methyl 4-cyano-3-methyl-5-[(2-phenylquinoline-4-carbonyl)amino]thiophene-2-carboxylate | methyl 4-cyano-3-methyl-5-{[(2-phenyl-4-quinolinyl)carbonyl]amino}-2-thiophenecarboxylate
Type:
Small organic molecule
Emp. Form.:
C24H17N3O3S
Mol. Mass.:
427.475
SMILES:
COC(=O)c1sc(NC(=O)c2cc(nc3ccccc23)-c2ccccc2)c(C#N)c1C
: