Target
Dual specificity protein phosphatase 3
Ligand
BDBM51775
Substrate
Meas. Tech.
uHTS absorbance assay for the identification of compounds that inhibit VHR1.
IC50
8440±n/a nM
Citation
 PubChem, PC uHTS absorbance assay for the identification of compounds that inhibit VHR1. PubChem Bioassay (2009)[AID] 
Target
Name:
Dual specificity protein phosphatase 3
Synonyms:
DUS3_HUMAN Dual specificity protein phosphatase (VHR) Dual specificity protein phosphatase VHR Tyrosine-protein phosphatase non-receptor type 1 | VHR
Type:
Hydrolase
Mol. Mass.:
20480.58
Organism:
Homo sapiens (Human)
Description:
Residue:
185
  
Inhibitor
Name:
BDBM51775
Synonyms:
2-[2-[(N''E)-N''-[4-(2,4-dichlorobenzyl)oxy-3-ethoxy-benzylidene]hydrazino]-4-keto-2-thiazolin-5-yl]acetic acid 2-[2-[2-[[4-[(2,4-dichlorophenyl)methoxy]-3-ethoxy-phenyl]methylidene]hydrazinyl]-4-oxidanylidene-1,3-thiazol-5-yl]ethanoic acid 2-[2-[2-[[4-[(2,4-dichlorophenyl)methoxy]-3-ethoxyphenyl]methylidene]hydrazinyl]-4-oxo-5-thiazolyl]acetic acid MLS000689950 [2-({4-[(2,4-dichlorobenzyl)oxy]-3-ethoxybenzylidene}hydrazono)-4-oxo-1,3-thiazolidin-5-yl]acetic acid | cid_2908705
Type:
Small organic molecule
Emp. Form.:
C21H19Cl2N3O5S
Mol. Mass.:
496.364
SMILES:
CCOc1cc(CN=Nc2nc(O)c(CC(O)=O)s2)ccc1OCc1ccc(Cl)cc1Cl
: