Target
Dual specificity protein phosphatase 3
Ligand
BDBM51777
Substrate
Meas. Tech.
uHTS absorbance assay for the identification of compounds that inhibit VHR1.
IC50
17400±n/a nM
Citation
 PubChem, PC uHTS absorbance assay for the identification of compounds that inhibit VHR1. PubChem Bioassay (2009)[AID] 
Target
Name:
Dual specificity protein phosphatase 3
Synonyms:
DUS3_HUMAN Dual specificity protein phosphatase (VHR) Dual specificity protein phosphatase VHR Tyrosine-protein phosphatase non-receptor type 1 | VHR
Type:
Hydrolase
Mol. Mass.:
20480.58
Organism:
Homo sapiens (Human)
Description:
Residue:
185
  
Inhibitor
Name:
BDBM51777
Synonyms:
3-[7-[(6-chloranyl-1,3-benzodioxol-5-yl)methoxy]-4,8-dimethyl-2-oxidanylidene-chromen-3-yl]propanoic acid 3-[7-[(6-chloro-1,3-benzodioxol-5-yl)methoxy]-4,8-dimethyl-2-oxo-1-benzopyran-3-yl]propanoic acid 3-{7-[(6-chloro-1,3-benzodioxol-5-yl)methoxy]-4,8-dimethyl-2-oxo-2H-chromen-3-yl}propanoic acid SMR000300092 | cid_1800867
Type:
Small organic molecule
Emp. Form.:
C22H19ClO7
Mol. Mass.:
430.835
SMILES:
Cc1c(OCc2cc3OCOc3cc2Cl)ccc2c(C)c(CCC(O)=O)c(=O)oc12
: