Target
Dual specificity protein phosphatase 3
Ligand
BDBM50513
Substrate
Meas. Tech.
uHTS absorbance assay for the identification of compounds that inhibit VHR1.
IC50
3390±n/a nM
Citation
 PubChem, PC uHTS absorbance assay for the identification of compounds that inhibit VHR1. PubChem Bioassay (2009)[AID] 
Target
Name:
Dual specificity protein phosphatase 3
Synonyms:
DUS3_HUMAN Dual specificity protein phosphatase (VHR) Dual specificity protein phosphatase VHR Tyrosine-protein phosphatase non-receptor type 1 | VHR
Type:
Hydrolase
Mol. Mass.:
20480.58
Organism:
Homo sapiens (Human)
Description:
Residue:
185
  
Inhibitor
Name:
BDBM50513
Synonyms:
4-(2,6-bis(3,4-dimethylphenyl)-1,3,5,7-tetraoxo-1,2,3,5,6,7-hexahydropyrrolo[3,4-f]isoindole-4-carbonyl)benzoic acid 4-[2,6-bis(3,4-dimethylphenyl)-1,3,5,7-tetrakis(oxidanylidene)pyrrolo[3,4-f]isoindol-8-yl]carbonylbenzoic acid 4-[[2,6-bis(3,4-dimethylphenyl)-1,3,5,7-tetraoxo-8-pyrrolo[3,4-f]isoindolyl]-oxomethyl]benzoic acid MLS000714384 cid_3108985
Type:
Small organic molecule
Emp. Form.:
C34H24N2O7
Mol. Mass.:
572.5636
SMILES:
Cc1ccc(cc1C)-n1c(=O)c2cc3c(c(C(=O)c4ccc(cc4)C(O)=O)c2c1=O)c(=O)n(-c1ccc(C)c(C)c1)c3=O
: