Target
Dual specificity protein phosphatase 3
Ligand
BDBM46222
Substrate
Meas. Tech.
uHTS absorbance assay for the identification of compounds that inhibit VHR1.
IC50
2090±n/a nM
Citation
 PubChem, PC uHTS absorbance assay for the identification of compounds that inhibit VHR1. PubChem Bioassay (2009)[AID] 
Target
Name:
Dual specificity protein phosphatase 3
Synonyms:
DUS3_HUMAN Dual specificity protein phosphatase (VHR) Dual specificity protein phosphatase VHR Tyrosine-protein phosphatase non-receptor type 1 | VHR
Type:
Hydrolase
Mol. Mass.:
20480.58
Organism:
Homo sapiens (Human)
Description:
Residue:
185
  
Inhibitor
Name:
BDBM46222
Synonyms:
3-(3-chloranyl-4-methoxy-phenyl)-1-(3-methylbutyl)-1-(1-propan-2-ylpiperidin-4-yl)thiourea 3-(3-chloro-4-methoxyphenyl)-1-(3-methylbutyl)-1-(1-propan-2-yl-4-piperidinyl)thiourea MLS-0330044.0001 | cid_24761488
Type:
Small organic molecule
Emp. Form.:
C21H34ClN3OS
Mol. Mass.:
412.032
SMILES:
COc1ccc(NC(=S)N(CCC(C)C)C2CCN(CC2)C(C)C)cc1Cl
: