Target
Kappa-type opioid receptor
Ligand
BDBM38931
Substrate
Meas. Tech.
uHTS identification of small molecule antagonists of the kappa opioid receptor via a luminescent beta-arrestin assay
IC50
747±n/a nM
Citation
 PubChem, PC uHTS identification of small molecule antagonists of the kappa opioid receptor via a luminescent beta-arrestin assay PubChem Bioassay (2009)[AID] 
Target
Name:
Kappa-type opioid receptor
Synonyms:
K-OR-1 Kappa-opioid receptor (KOR) Kappa-type opioid receptor (KOR) OPIATE Kappa OPRK1 kappa opioid receptor (KOR)
Type:
G Protein-Coupled Receptor (GPCR)
Mol. Mass.:
42648.76
Organism:
Homo sapiens (Human)
Description:
P41145
Residue:
380
  
Inhibitor
Name:
BDBM38931
Synonyms:
6-methyl-2-[3-methyl-5-(4-methylanilino)-1-pyrazolyl]-1H-pyrimidin-4-one 6-methyl-2-[3-methyl-5-(p-toluidino)pyrazol-1-yl]-1H-pyrimidin-4-one MLS000036000 cid_2408467
Type:
Small organic molecule
Emp. Form.:
C16H17N5O
Mol. Mass.:
295.3391
SMILES:
Cc1cc(Nc2ccc(C)cc2)n(n1)-c1nc(C)cc(=O)[nH]1
: