Target
Kappa-type opioid receptor
Ligand
BDBM54799
Substrate
Meas. Tech.
uHTS identification of small molecule antagonists of the kappa opioid receptor via a luminescent beta-arrestin assay
IC50
3320±n/a nM
Citation
 PubChem, PC uHTS identification of small molecule antagonists of the kappa opioid receptor via a luminescent beta-arrestin assay PubChem Bioassay (2009)[AID] 
Target
Name:
Kappa-type opioid receptor
Synonyms:
K-OR-1 Kappa-opioid receptor (KOR) Kappa-type opioid receptor (KOR) OPIATE Kappa OPRK1 kappa opioid receptor (KOR)
Type:
G Protein-Coupled Receptor (GPCR)
Mol. Mass.:
42648.76
Organism:
Homo sapiens (Human)
Description:
P41145
Residue:
380
  
Inhibitor
Name:
BDBM54799
Synonyms:
2-(2,3,4,5,6-pentafluorophenyl)-1-benzopyran-4-one 2-(2,3,4,5,6-pentafluorophenyl)chromone MLS000568955 cid_2055076
Type:
Small organic molecule
Emp. Form.:
C15H5F5O2
Mol. Mass.:
312.191
SMILES:
Fc1c(F)c(F)c(c(F)c1F)-c1cc(=O)c2ccccc2o1
: