Target
Kappa-type opioid receptor
Ligand
BDBM54805
Substrate
Meas. Tech.
uHTS identification of small molecule antagonists of the kappa opioid receptor via a luminescent beta-arrestin assay
IC50
3480±n/a nM
Citation
 PubChem, PC uHTS identification of small molecule antagonists of the kappa opioid receptor via a luminescent beta-arrestin assay PubChem Bioassay (2009)[AID] 
Target
Name:
Kappa-type opioid receptor
Synonyms:
K-OR-1 Kappa-opioid receptor (KOR) Kappa-type opioid receptor (KOR) OPIATE Kappa OPRK1 kappa opioid receptor (KOR)
Type:
G Protein-Coupled Receptor (GPCR)
Mol. Mass.:
42648.76
Organism:
Homo sapiens (Human)
Description:
P41145
Residue:
380
  
Inhibitor
Name:
BDBM54805
Synonyms:
(phenylmethyl) N-[1-[[2,6-bis(chloranyl)phenyl]carbamothioylamino]-2,2,2-tris(chloranyl)ethyl]carbamate N-[2,2,2-trichloro-1-[(2,6-dichlorophenyl)thiocarbamoylamino]ethyl]carbamic acid benzyl ester SMR000173875 cid_3091265 | {2,2,2-Trichloro-1-[3-(2,6-dichloro-phenyl)-thioureido]-ethyl}-carbamic acid benzyl ester
Type:
Small organic molecule
Emp. Form.:
C17H14Cl5N3O2S
Mol. Mass.:
501.642
SMILES:
Clc1cccc(Cl)c1NC(=S)NC(NC(=O)OCc1ccccc1)C(Cl)(Cl)Cl
: