Target
Kappa-type opioid receptor
Ligand
BDBM43416
Substrate
Meas. Tech.
uHTS identification of small molecule antagonists of the kappa opioid receptor via a luminescent beta-arrestin assay
IC50
2140±n/a nM
Citation
 PubChem, PC uHTS identification of small molecule antagonists of the kappa opioid receptor via a luminescent beta-arrestin assay PubChem Bioassay (2009)[AID] 
Target
Name:
Kappa-type opioid receptor
Synonyms:
K-OR-1 Kappa-opioid receptor (KOR) Kappa-type opioid receptor (KOR) OPIATE Kappa OPRK1 kappa opioid receptor (KOR)
Type:
G Protein-Coupled Receptor (GPCR)
Mol. Mass.:
42648.76
Organism:
Homo sapiens (Human)
Description:
P41145
Residue:
380
  
Inhibitor
Name:
BDBM43416
Synonyms:
MLS000375336 N-[1-(1-adamantyl)ethyl]-2-(4,5-dichloro-6-oxo-1-pyridazinyl)acetamide N-[1-(1-adamantyl)ethyl]-2-[4,5-bis(chloranyl)-6-oxidanylidene-pyridazin-1-yl]ethanamide cid_4811966
Type:
Small organic molecule
Emp. Form.:
C18H23Cl2N3O2
Mol. Mass.:
384.3
SMILES:
[H]C12CC3([H])CC([H])(C1)CC(C2)(C3)C(C)NC(=O)Cn1ncc(Cl)c(Cl)c1=O
: