Target
Tyrosine-protein phosphatase non-receptor type 22
Ligand
BDBM54791
Substrate
Meas. Tech.
uHTS identification of small molecule inhibitors of LYP via a fluorescence intensity assay
IC50
50796.05±n/a nM
Citation
 PubChem, PC uHTS identification of small molecule inhibitors of LYP via a fluorescence intensity assay PubChem Bioassay (2009)[AID] 
Target
Name:
Tyrosine-protein phosphatase non-receptor type 22
Synonyms:
3.1.3.48 LyP Lymphoid phosphatase (Lyp) PEST-domain phosphatase PTPN22 Tyrosine-protein phosphatase non-receptor type 22 (LYP) | tyrosine-protein phosphatase non-receptor type 22 isoform 1
Type:
Mol. Mass.:
91712.31
Organism:
Homo sapiens (Human)
Description:
Q9Y2R2
Residue:
807
  
Inhibitor
Name:
BDBM54791
Synonyms:
5-chloranyl-2-methoxy-N-[3-([1,2,4]triazolo[4,3-b]pyridazin-6-yl)phenyl]benzamide MLS000685766 cid_7217786
Type:
Small organic molecule
Emp. Form.:
C19H14ClN5O2
Mol. Mass.:
379.8
SMILES:
COc1ccc(Cl)cc1C(=O)Nc1cccc(c1)-c1ccc2nncn2n1
: