Target
Plectin
Ligand
BDBM50080733
Substrate
Meas. Tech.
uHTS identification of small molecule antagonists of the binding of Siah-1 and a peptide ligand via a fluorescence polarization assay.
IC50
200000±n/a nM
Citation
 PubChem, PC uHTS identification of small molecule antagonists of the binding of Siah-1 and a peptide ligand via a fluorescence polarization assay. PubChem Bioassay (2009)[AID] 
Target
Name:
Plectin
Synonyms:
PLEC PLEC_HUMAN | plectin 1
Type:
Enzyme Catalytic Domain
Mol. Mass.:
531740.96
Organism:
Homo sapiens (Human)
Description:
Q15149
Residue:
4684
  
Inhibitor
Name:
BDBM50080733
Synonyms:
4-(4-aminophenylsulfonamido)-1-benzenesulfonamide 4-amino-N-[4-(aminosulfonyl)phenyl]benzenesulfonamide CHEMBL269122 | cid_68351
Type:
Small organic molecule
Emp. Form.:
C12H13N3O4S2
Mol. Mass.:
327.379
SMILES:
Nc1ccc(cc1)S(=O)(=O)Nc1ccc(cc1)S(N)(=O)=O
: