Target
Plectin
Ligand
BDBM54903
Substrate
Meas. Tech.
uHTS identification of small molecule antagonists of the binding of Siah-1 and a peptide ligand via a fluorescence polarization assay.
IC50
200000±n/a nM
Citation
 PubChem, PC uHTS identification of small molecule antagonists of the binding of Siah-1 and a peptide ligand via a fluorescence polarization assay. PubChem Bioassay (2009)[AID] 
Target
Name:
Plectin
Synonyms:
PLEC PLEC_HUMAN | plectin 1
Type:
Enzyme Catalytic Domain
Mol. Mass.:
531740.96
Organism:
Homo sapiens (Human)
Description:
Q15149
Residue:
4684
  
Inhibitor
Name:
BDBM54903
Synonyms:
2-hydroximino-N-[2-(1-methylpiperidin-1-ium-1-yl)ethyl]acetamide;iodide 2-hydroxyimino-N-[2-(1-methylpiperidin-1-ium-1-yl)ethyl]acetamide;iodide MLS000036962 cid_6400956
Type:
Small organic molecule
Emp. Form.:
C10H20N3O2
Mol. Mass.:
214.2842
SMILES:
C[N+]1(CCNC(=O)CN=O)CCCCC1
: