Target
Plectin
Ligand
BDBM40232
Substrate
Meas. Tech.
uHTS identification of small molecule antagonists of the binding of Siah-1 and a peptide ligand via a fluorescence polarization assay.
IC50
200000±n/a nM
Citation
 PubChem, PC uHTS identification of small molecule antagonists of the binding of Siah-1 and a peptide ligand via a fluorescence polarization assay. PubChem Bioassay (2009)[AID] 
Target
Name:
Plectin
Synonyms:
PLEC PLEC_HUMAN | plectin 1
Type:
Enzyme Catalytic Domain
Mol. Mass.:
531740.96
Organism:
Homo sapiens (Human)
Description:
Q15149
Residue:
4684
  
Inhibitor
Name:
BDBM40232
Synonyms:
(5Z)-5-[4-(dimethylamino)benzylidene]-4-(p-anisidino)-3-thiazolin-2-one (5Z)-5-[[4-(dimethylamino)phenyl]methylidene]-4-(4-methoxyanilino)-2-thiazolone 5-[1-(4-Dimethylamino-phenyl)-meth-(Z)-ylidene]-4-[(E)-4-methoxy-phenylimino]-thiazolidin-2-one SMR000147964 | cid_1182681
Type:
Small organic molecule
Emp. Form.:
C19H19N3O2S
Mol. Mass.:
353.438
SMILES:
COc1ccc(NC2=NC(=O)SC2=Cc2ccc(cc2)N(C)C)cc1
: