Target
Plectin
Ligand
BDBM60322
Substrate
Meas. Tech.
uHTS identification of small molecule antagonists of the binding of Siah-1 and a peptide ligand via a fluorescence polarization assay.
IC50
200000±n/a nM
Citation
 PubChem, PC uHTS identification of small molecule antagonists of the binding of Siah-1 and a peptide ligand via a fluorescence polarization assay. PubChem Bioassay (2009)[AID] 
Target
Name:
Plectin
Synonyms:
PLEC PLEC_HUMAN | plectin 1
Type:
Enzyme Catalytic Domain
Mol. Mass.:
531740.96
Organism:
Homo sapiens (Human)
Description:
Q15149
Residue:
4684
  
Inhibitor
Name:
BDBM60322
Synonyms:
1-(phenylcarbonyl)-2H-quinoline-2-carbonitrile MLS000718165 cid_26219
Type:
Small organic molecule
Emp. Form.:
C17H12N2O
Mol. Mass.:
260.29
SMILES:
O=C(N1C(C=Cc2ccccc12)C#N)c1ccccc1
: