Target
Plectin
Ligand
BDBM60326
Substrate
Meas. Tech.
uHTS identification of small molecule antagonists of the binding of Siah-1 and a peptide ligand via a fluorescence polarization assay.
IC50
200000±n/a nM
Citation
 PubChem, PC uHTS identification of small molecule antagonists of the binding of Siah-1 and a peptide ligand via a fluorescence polarization assay. PubChem Bioassay (2009)[AID] 
Target
Name:
Plectin
Synonyms:
PLEC PLEC_HUMAN | plectin 1
Type:
Enzyme Catalytic Domain
Mol. Mass.:
531740.96
Organism:
Homo sapiens (Human)
Description:
Q15149
Residue:
4684
  
Inhibitor
Name:
BDBM60326
Synonyms:
MLS001000393 N-[1-(2-fluorobenzyl)piperidin-3-yl]-3-(3-methoxyphenyl)-N-methylpropanamide N-[1-[(2-fluorophenyl)methyl]piperidin-3-yl]-3-(3-methoxyphenyl)-N-methyl-propanamide SMR000495605 | cid_23723716
Type:
Small organic molecule
Emp. Form.:
C23H29FN2O2
Mol. Mass.:
384.487
SMILES:
COc1cccc(CCC(=O)N(C)C2CCCN(Cc3ccccc3F)C2)c1
: