Target
Plectin
Ligand
BDBM54941
Substrate
Meas. Tech.
uHTS identification of small molecule antagonists of the binding of Siah-1 and a peptide ligand via a fluorescence polarization assay.
IC50
200000±n/a nM
Citation
 PubChem, PC uHTS identification of small molecule antagonists of the binding of Siah-1 and a peptide ligand via a fluorescence polarization assay. PubChem Bioassay (2009)[AID] 
Target
Name:
Plectin
Synonyms:
PLEC PLEC_HUMAN | plectin 1
Type:
Enzyme Catalytic Domain
Mol. Mass.:
531740.96
Organism:
Homo sapiens (Human)
Description:
Q15149
Residue:
4684
  
Inhibitor
Name:
BDBM54941
Synonyms:
3-(butylamino)-6-(4-chlorobenzyl)-2H-1,2,4-triazin-5-one MLS001215795 cid_8030844
Type:
Small organic molecule
Emp. Form.:
C14H17ClN4O
Mol. Mass.:
292.764
SMILES:
CCCCNc1nnc(Cc2ccc(Cl)cc2)c(=O)[nH]1
: