Target
Plectin
Ligand
BDBM60332
Substrate
Meas. Tech.
uHTS identification of small molecule antagonists of the binding of Siah-1 and a peptide ligand via a fluorescence polarization assay.
IC50
200000±n/a nM
Citation
 PubChem, PC uHTS identification of small molecule antagonists of the binding of Siah-1 and a peptide ligand via a fluorescence polarization assay. PubChem Bioassay (2009)[AID] 
Target
Name:
Plectin
Synonyms:
PLEC PLEC_HUMAN | plectin 1
Type:
Enzyme Catalytic Domain
Mol. Mass.:
531740.96
Organism:
Homo sapiens (Human)
Description:
Q15149
Residue:
4684
  
Inhibitor
Name:
BDBM60332
Synonyms:
MLS001124383 N-[2-(4-chlorophenyl)ethyl]-2-(8-methyl-5-oxidanylidene-pyrido[2,3-b][1,5]benzoxazepin-6-yl)ethanamide N-[2-(4-chlorophenyl)ethyl]-2-(8-methyl-5-oxopyrido[2,3-b][1,5]benzoxazepin-6-yl)acetamide cid_16021170
Type:
Small organic molecule
Emp. Form.:
C23H20ClN3O3
Mol. Mass.:
421.876
SMILES:
Cc1ccc2Oc3ncccc3C(=O)N(CC(=O)NCCc3ccc(Cl)cc3)c2c1
: