Target
Plectin
Ligand
BDBM54945
Substrate
Meas. Tech.
uHTS identification of small molecule antagonists of the binding of Siah-1 and a peptide ligand via a fluorescence polarization assay.
IC50
200000±n/a nM
Citation
 PubChem, PC uHTS identification of small molecule antagonists of the binding of Siah-1 and a peptide ligand via a fluorescence polarization assay. PubChem Bioassay (2009)[AID] 
Target
Name:
Plectin
Synonyms:
PLEC PLEC_HUMAN | plectin 1
Type:
Enzyme Catalytic Domain
Mol. Mass.:
531740.96
Organism:
Homo sapiens (Human)
Description:
Q15149
Residue:
4684
  
Inhibitor
Name:
BDBM54945
Synonyms:
MLS001116432 N-butyl-N-[(6-methoxy-2-oxidanylidene-1H-quinolin-3-yl)methyl]-4-methyl-benzenesulfonamide SMR000625538 | cid_17101180
Type:
Small organic molecule
Emp. Form.:
C22H26N2O4S
Mol. Mass.:
414.518
SMILES:
CCCCN(Cc1cc2cc(OC)ccc2[nH]c1=O)S(=O)(=O)c1ccc(C)cc1
: