Target
Plectin
Ligand
BDBM60338
Substrate
Meas. Tech.
uHTS identification of small molecule antagonists of the binding of Siah-1 and a peptide ligand via a fluorescence polarization assay.
IC50
200000±n/a nM
Citation
 PubChem, PC uHTS identification of small molecule antagonists of the binding of Siah-1 and a peptide ligand via a fluorescence polarization assay. PubChem Bioassay (2009)[AID] 
Target
Name:
Plectin
Synonyms:
PLEC PLEC_HUMAN | plectin 1
Type:
Enzyme Catalytic Domain
Mol. Mass.:
531740.96
Organism:
Homo sapiens (Human)
Description:
Q15149
Residue:
4684
  
Inhibitor
Name:
BDBM60338
Synonyms:
MLS001125062 N-(2-morpholin-4-yl-5-nitrophenyl)thiophene-2-carboxamide N-[2-(4-morpholinyl)-5-nitrophenyl]-2-thiophenecarboxamide cid_2966189
Type:
Small organic molecule
Emp. Form.:
C15H15N3O4S
Mol. Mass.:
333.362
SMILES:
[O-][N+](=O)c1ccc(N2CCOCC2)c(NC(=O)c2cccs2)c1
: