Target
Plectin
Ligand
BDBM54946
Substrate
Meas. Tech.
uHTS identification of small molecule antagonists of the binding of Siah-1 and a peptide ligand via a fluorescence polarization assay.
IC50
16761±n/a nM
Citation
 PubChem, PC uHTS identification of small molecule antagonists of the binding of Siah-1 and a peptide ligand via a fluorescence polarization assay. PubChem Bioassay (2009)[AID] 
Target
Name:
Plectin
Synonyms:
PLEC PLEC_HUMAN | plectin 1
Type:
Enzyme Catalytic Domain
Mol. Mass.:
531740.96
Organism:
Homo sapiens (Human)
Description:
Q15149
Residue:
4684
  
Inhibitor
Name:
BDBM54946
Synonyms:
(2S)-2-[[(2S)-1-oxo-2-[[1-oxo-3-(3,5,9-trimethyl-7-oxo-6-furo[3,2-g][1]benzopyranyl)propyl]amino]propyl]amino]-3-phenylpropanoic acid (2S)-3-phenyl-2-[[(2S)-2-[3-(3,5,9-trimethyl-7-oxidanylidene-furo[3,2-g]chromen-6-yl)propanoylamino]propanoyl]amino]propanoic acid MLS001140219 cid_16405959
Type:
Small organic molecule
Emp. Form.:
C29H30N2O7
Mol. Mass.:
518.5577
SMILES:
C[C@H](NC(=O)CCc1c(C)c2cc3c(C)coc3c(C)c2oc1=O)C(=O)N[C@@H](Cc1ccccc1)C(O)=O
: