Target
Large T antigen
Ligand
BDBM60342
Substrate
Meas. Tech.
Identification of SV40 T antigen inhibitors: A route to novel anti-viral reagents
IC50
14730±n/a nM
Citation
 PubChem, PC Identification of SV40 T antigen inhibitors: A route to novel anti-viral reagents PubChem Bioassay (2010)[AID] 
Target
Name:
Large T antigen
Synonyms:
LT LT_SV40
Type:
Enzyme Catalytic Domain
Mol. Mass.:
81575.54
Organism:
Simian virus 40
Description:
P03070
Residue:
708
  
Inhibitor
Name:
BDBM60342
Synonyms:
2-[[2-(4-hydroxyphenyl)-3-imidazo[1,2-a]pyridinyl]amino]acetic acid ethyl ester MLS000074140 [2-(4-Hydroxy-phenyl)-imidazo[1,2-a]pyridin-3-ylamino]-acetic acid ethyl ester ethyl 2-[[2-(4-hydroxyphenyl)imidazo[1,2-a]pyridin-3-yl]amino]acetate | ethyl 2-[[2-(4-hydroxyphenyl)imidazo[1,2-a]pyridin-3-yl]amino]ethanoate
Type:
Small organic molecule
Emp. Form.:
C17H17N3O3
Mol. Mass.:
311.3352
SMILES:
CCOC(=O)CNc1c(nc2ccccn12)-c1ccc(O)cc1
: