Target
Large T antigen
Ligand
BDBM60344
Substrate
Meas. Tech.
Identification of SV40 T antigen inhibitors: A route to novel anti-viral reagents
IC50
23220±n/a nM
Citation
 PubChem, PC Identification of SV40 T antigen inhibitors: A route to novel anti-viral reagents PubChem Bioassay (2010)[AID] 
Target
Name:
Large T antigen
Synonyms:
LT LT_SV40
Type:
Enzyme Catalytic Domain
Mol. Mass.:
81575.54
Organism:
Simian virus 40
Description:
P03070
Residue:
708
  
Inhibitor
Name:
BDBM60344
Synonyms:
MLS000075410 N-(2-amino-4-thiophen-2-yl-1,3-thiazol-5-yl)benzamide N-(2-azanyl-4-thiophen-2-yl-1,3-thiazol-5-yl)benzamide SMR000011198 | cid_645238
Type:
Small organic molecule
Emp. Form.:
C14H11N3OS2
Mol. Mass.:
301.387
SMILES:
Nc1nc(c(NC(=O)c2ccccc2)s1)-c1cccs1
: