Target
Large T antigen
Ligand
BDBM60345
Substrate
Meas. Tech.
Identification of SV40 T antigen inhibitors: A route to novel anti-viral reagents
IC50
46560±n/a nM
Citation
 PubChem, PC Identification of SV40 T antigen inhibitors: A route to novel anti-viral reagents PubChem Bioassay (2010)[AID] 
Target
Name:
Large T antigen
Synonyms:
LT LT_SV40
Type:
Enzyme Catalytic Domain
Mol. Mass.:
81575.54
Organism:
Simian virus 40
Description:
P03070
Residue:
708
  
Inhibitor
Name:
BDBM60345
Synonyms:
5-Hydroxy-2-phenyl-benzofuran-3-carboxylic acid dimethylamide 5-hydroxy-N,N-dimethyl-2-phenyl-3-benzofurancarboxamide MLS000034870 SMR000011461 | cid_646279
Type:
Small organic molecule
Emp. Form.:
C17H15NO3
Mol. Mass.:
281.3059
SMILES:
CN(C)C(=O)c1c(oc2ccc(O)cc12)-c1ccccc1
: