Target
Large T antigen
Ligand
BDBM38939
Substrate
Meas. Tech.
Identification of SV40 T antigen inhibitors: A route to novel anti-viral reagents
IC50
4270±n/a nM
Citation
 PubChem, PC Identification of SV40 T antigen inhibitors: A route to novel anti-viral reagents PubChem Bioassay (2010)[AID] 
Target
Name:
Large T antigen
Synonyms:
LT LT_SV40
Type:
Enzyme Catalytic Domain
Mol. Mass.:
81575.54
Organism:
Simian virus 40
Description:
P03070
Residue:
708
  
Inhibitor
Name:
BDBM38939
Synonyms:
(4E)-3-hydroxy-4-[[(4-methyl-2-methylimino-1,3-thiazol-3-yl)amino]methylidene]cyclohexa-2,5-dien-1-one (4E)-3-hydroxy-4-[[(4-methyl-2-methylimino-4-thiazolin-3-yl)amino]methylene]cyclohexa-2,5-dien-1-one MLS000096544 cid_5742517
Type:
Small organic molecule
Emp. Form.:
C12H13N3O2S
Mol. Mass.:
263.316
SMILES:
CN=c1scc(C)n1N=Cc1ccc(O)cc1O
: