Target
Large T antigen
Ligand
BDBM38617
Substrate
Meas. Tech.
Identification of SV40 T antigen inhibitors: A route to novel anti-viral reagents
IC50
8170±n/a nM
Citation
 PubChem, PC Identification of SV40 T antigen inhibitors: A route to novel anti-viral reagents PubChem Bioassay (2010)[AID] 
Target
Name:
Large T antigen
Synonyms:
LT LT_SV40
Type:
Enzyme Catalytic Domain
Mol. Mass.:
81575.54
Organism:
Simian virus 40
Description:
P03070
Residue:
708
  
Inhibitor
Name:
BDBM38617
Synonyms:
MLS000092916 N-[2-(diethylamino)ethyl]-5-(8-methoxy-4-oxidanylidene-2-sulfanylidene-1,5-dihydropyrimido[5,4-b]indol-3-yl)pentanamide N-[2-(diethylamino)ethyl]-5-(8-methoxy-4-oxo-2-thioxo-1,2,4,5-tetrahydro-3H-pyrimido[5,4-b]indol-3-yl)pentanamide cid_3244883
Type:
Small organic molecule
Emp. Form.:
C22H31N5O3S
Mol. Mass.:
445.578
SMILES:
CCN(CC)CCNC(=O)CCCCn1c(=S)[nH]c2c3cc(OC)ccc3[nH]c2c1=O
: