Target
Large T antigen
Ligand
BDBM58958
Substrate
Meas. Tech.
Identification of SV40 T antigen inhibitors: A route to novel anti-viral reagents
IC50
18910±n/a nM
Citation
 PubChem, PC Identification of SV40 T antigen inhibitors: A route to novel anti-viral reagents PubChem Bioassay (2010)[AID] 
Target
Name:
Large T antigen
Synonyms:
LT LT_SV40
Type:
Enzyme Catalytic Domain
Mol. Mass.:
81575.54
Organism:
Simian virus 40
Description:
P03070
Residue:
708
  
Inhibitor
Name:
BDBM58958
Synonyms:
5-amino-N-(2-methylphenyl)-2-(1-piperidinyl)benzamide 5-amino-N-(o-tolyl)-2-piperidino-benzamide MLS000099885 cid_2227158
Type:
Small organic molecule
Emp. Form.:
C19H23N3O
Mol. Mass.:
309.4054
SMILES:
Cc1ccccc1NC(=O)c1cc(N)ccc1N1CCCCC1
: