Target
Large T antigen
Ligand
BDBM42946
Substrate
Meas. Tech.
Identification of SV40 T antigen inhibitors: A route to novel anti-viral reagents
IC50
7660±n/a nM
Citation
 PubChem, PC Identification of SV40 T antigen inhibitors: A route to novel anti-viral reagents PubChem Bioassay (2010)[AID] 
Target
Name:
Large T antigen
Synonyms:
LT LT_SV40
Type:
Enzyme Catalytic Domain
Mol. Mass.:
81575.54
Organism:
Simian virus 40
Description:
P03070
Residue:
708
  
Inhibitor
Name:
BDBM42946
Synonyms:
(6-morpholino-1,3-benzothiazol-2-yl)amine 6-morpholin-4-yl-1,3-benzothiazol-2-amine SMR000075944 | cid_937197
Type:
Small organic molecule
Emp. Form.:
C11H13N3OS
Mol. Mass.:
235.305
SMILES:
Nc1nc2ccc(cc2s1)N1CCOCC1
: