Target
Large T antigen
Ligand
BDBM60385
Substrate
Meas. Tech.
Identification of SV40 T antigen inhibitors: A route to novel anti-viral reagents
IC50
7430±n/a nM
Citation
 PubChem, PC Identification of SV40 T antigen inhibitors: A route to novel anti-viral reagents PubChem Bioassay (2010)[AID] 
Target
Name:
Large T antigen
Synonyms:
LT LT_SV40
Type:
Enzyme Catalytic Domain
Mol. Mass.:
81575.54
Organism:
Simian virus 40
Description:
P03070
Residue:
708
  
Inhibitor
Name:
BDBM60385
Synonyms:
MLS000051916 N-(4-anilinophenyl)morpholine-4-carboxamide SMR000081069 | cid_752006
Type:
Small organic molecule
Emp. Form.:
C17H19N3O2
Mol. Mass.:
297.3517
SMILES:
O=C(Nc1ccc(Nc2ccccc2)cc1)N1CCOCC1
: