Target
Large T antigen
Ligand
BDBM60389
Substrate
Meas. Tech.
Identification of SV40 T antigen inhibitors: A route to novel anti-viral reagents
IC50
4900±n/a nM
Citation
 PubChem, PC Identification of SV40 T antigen inhibitors: A route to novel anti-viral reagents PubChem Bioassay (2010)[AID] 
Target
Name:
Large T antigen
Synonyms:
LT LT_SV40
Type:
Enzyme Catalytic Domain
Mol. Mass.:
81575.54
Organism:
Simian virus 40
Description:
P03070
Residue:
708
  
Inhibitor
Name:
BDBM60389
Synonyms:
2-methoxy-4-(2-methyl-1,3-thiazol-4-yl)phenol 2-methoxy-4-(2-methylthiazol-4-yl)phenol SMR000070499 | cid_838952
Type:
Small organic molecule
Emp. Form.:
C11H11NO2S
Mol. Mass.:
221.276
SMILES:
COc1cc(ccc1O)-c1csc(C)n1
: