Target
Large T antigen
Ligand
BDBM60396
Substrate
Meas. Tech.
Identification of SV40 T antigen inhibitors: A route to novel anti-viral reagents
IC50
36340±n/a nM
Citation
 PubChem, PC Identification of SV40 T antigen inhibitors: A route to novel anti-viral reagents PubChem Bioassay (2010)[AID] 
Target
Name:
Large T antigen
Synonyms:
LT LT_SV40
Type:
Enzyme Catalytic Domain
Mol. Mass.:
81575.54
Organism:
Simian virus 40
Description:
P03070
Residue:
708
  
Inhibitor
Name:
BDBM60396
Synonyms:
8-(2-chlorophenyl)-6-keto-3-phenyl-2,4,7,8-tetrahydropyrido[2,1-b][1,3,5]thiadiazine-9-carbonitrile 8-(2-chlorophenyl)-6-oxo-3-phenyl-2,4,7,8-tetrahydropyrido[2,1-b][1,3,5]thiadiazine-9-carbonitrile SMR000094196 | cid_5308643
Type:
Small organic molecule
Emp. Form.:
C20H16ClN3OS
Mol. Mass.:
381.879
SMILES:
Clc1ccccc1C1CC(=O)N2CN(CSC2=C1C#N)c1ccccc1
: