Target
Large T antigen
Ligand
BDBM34523
Substrate
Meas. Tech.
Identification of SV40 T antigen inhibitors: A route to novel anti-viral reagents
IC50
17380±n/a nM
Citation
 PubChem, PC Identification of SV40 T antigen inhibitors: A route to novel anti-viral reagents PubChem Bioassay (2010)[AID] 
Target
Name:
Large T antigen
Synonyms:
LT LT_SV40
Type:
Enzyme Catalytic Domain
Mol. Mass.:
81575.54
Organism:
Simian virus 40
Description:
P03070
Residue:
708
  
Inhibitor
Name:
BDBM34523
Synonyms:
8-(2-chlorophenyl)-3-(4-ethoxyphenyl)-6-oxidanylidene-2,4,7,8-tetrahydropyrido[2,1-b][1,3,5]thiadiazine-9-carbonitrile 8-(2-chlorophenyl)-6-keto-3-p-phenetyl-2,4,7,8-tetrahydropyrido[2,1-b][1,3,5]thiadiazine-9-carbonitrile SMR000094225 | cid_5309663
Type:
Small organic molecule
Emp. Form.:
C22H20ClN3O2S
Mol. Mass.:
425.931
SMILES:
CCOc1ccc(cc1)N1CSC2=C(C#N)C(CC(=O)N2C1)c1ccccc1Cl
: