Target
Large T antigen
Ligand
BDBM33060
Substrate
Meas. Tech.
Identification of SV40 T antigen inhibitors: A route to novel anti-viral reagents
IC50
35380±n/a nM
Citation
 PubChem, PC Identification of SV40 T antigen inhibitors: A route to novel anti-viral reagents PubChem Bioassay (2010)[AID] 
Target
Name:
Large T antigen
Synonyms:
LT LT_SV40
Type:
Enzyme Catalytic Domain
Mol. Mass.:
81575.54
Organism:
Simian virus 40
Description:
P03070
Residue:
708
  
Inhibitor
Name:
BDBM33060
Synonyms:
4-(5-methyl-2-furanyl)-2-sulfanylidene-5,6,7,8-tetrahydro-1H-quinoline-3-carbonitrile 4-(5-methylfuran-2-yl)-2-sulfanylidene-5,6,7,8-tetrahydro-1H-quinoline-3-carbonitrile SMR000102919 | cid_783279
Type:
Small organic molecule
Emp. Form.:
C15H14N2OS
Mol. Mass.:
270.349
SMILES:
Cc1ccc(o1)-c1c2CCCCc2[nH]c(=S)c1C#N
: