Target
G-protein coupled receptor 55
Ligand
BDBM61000
Substrate
Meas. Tech.
Image-based HTS for Selective Agonists of GPR55
EC50
32000±n/a nM
Citation
 PubChem, PC Image-based HTS for Selective Agonists of GPR55 PubChem Bioassay (2010)[AID] 
Target
Name:
G-protein coupled receptor 55
Synonyms:
G protein-coupled receptor 55 GPR55_HUMAN
Type:
PROTEIN
Mol. Mass.:
36649.72
Organism:
Homo sapiens (Human)
Description:
ChEMBL_1292265
Residue:
319
  
Inhibitor
Name:
BDBM61000
Synonyms:
1-(4-acetyl-2,5-dimethyl-1-piperonyl-pyrrol-3-yl)ethanone 1-[4-acetyl-1-(1,3-benzodioxol-5-ylmethyl)-2,5-dimethyl-3-pyrrolyl]ethanone MLS000039675 cid_666390
Type:
Small organic molecule
Emp. Form.:
C18H19NO4
Mol. Mass.:
313.3478
SMILES:
CC(=O)c1c(C)n(Cc2ccc3OCOc3c2)c(C)c1C(C)=O
: