Target
G-protein coupled receptor 55
Ligand
BDBM56974
Substrate
Meas. Tech.
Image-based HTS for Selective Agonists of GPR55
EC50
4697.589±n/a nM
Citation
 PubChem, PC Image-based HTS for Selective Agonists of GPR55 PubChem Bioassay (2010)[AID] 
Target
Name:
G-protein coupled receptor 55
Synonyms:
G protein-coupled receptor 55 GPR55_HUMAN
Type:
PROTEIN
Mol. Mass.:
36649.72
Organism:
Homo sapiens (Human)
Description:
ChEMBL_1292265
Residue:
319
  
Inhibitor
Name:
BDBM56974
Synonyms:
7-amyl-8-[[4-(5-chloro-2-methyl-phenyl)piperazino]methyl]-3-methyl-xanthine 8-[[4-(5-chloro-2-methylphenyl)-1-piperazinyl]methyl]-3-methyl-7-pentylpurine-2,6-dione 8-{[4-(5-chloro-2-methylphenyl)piperazin-1-yl]methyl}-3-methyl-7-pentyl-3,7-dihydro-1H-purine-2,6-dione SMR000028662 | cid_3238162
Type:
Small organic molecule
Emp. Form.:
C23H31ClN6O2
Mol. Mass.:
458.984
SMILES:
CCCCCn1c(CN2CCN(CC2)c2cc(Cl)ccc2C)nc2n(C)c(=O)[nH]c(=O)c12
: