Target
SUMO-activating enzyme subunit 1
Ligand
BDBM61215
Substrate
Meas. Tech.
uHTS HTRF assay for identification of inhibitors of SUMOylation
IC50
9220±n/a nM
Citation
 PubChem, PC uHTS HTRF assay for identification of inhibitors of SUMOylation PubChem Bioassay (2010)[AID] 
Target
Name:
SUMO-activating enzyme subunit 1
Synonyms:
AOS1 SAE1_HUMAN SUMO-activating enzyme subunit 1 (SAE1) UBLE1A
Type:
Enzyme Catalytic Domain
Mol. Mass.:
38440.84
Organism:
Homo sapiens (Human)
Description:
gi_17390638
Residue:
346
  
Inhibitor
Name:
BDBM61215
Synonyms:
(5-amino-1-naphthalenyl)arsonic acid (5-aminonaphthalen-1-yl)arsonic acid MLS000737441 cid_224922
Type:
Small organic molecule
Emp. Form.:
C10H10AsNO3
Mol. Mass.:
267.1129
SMILES:
Nc1cccc2c(cccc12)[As](O)(O)=O
: