Target
Eukaryotic translation initiation factor 4H
Ligand
BDBM61271
Substrate
Meas. Tech.
uHTS fluorescence polarization assay for the identification of translation initiation inhibitors (eIF4H)
IC50
100000±n/a nM
Citation
 PubChem, PC uHTS fluorescence polarization assay for the identification of translation initiation inhibitors (eIF4H) PubChem Bioassay (2009)[AID] 
Target
Name:
Eukaryotic translation initiation factor 4H
Synonyms:
EIF4H KIAA0038 WSCR1
Type:
Enzyme Catalytic Domain
Mol. Mass.:
27385.24
Organism:
Homo sapiens (Human)
Description:
Q15056
Residue:
248
  
Inhibitor
Name:
BDBM61271
Synonyms:
MLS000040467 N-[3-[4-methyl-5-(2-morpholin-4-yl-2-oxoethyl)sulfanyl-1,2,4-triazol-3-yl]phenyl]benzamide N-[3-[5-[(2-keto-2-morpholino-ethyl)thio]-4-methyl-1,2,4-triazol-3-yl]phenyl]benzamide cid_664335
Type:
Small organic molecule
Emp. Form.:
C22H23N5O3S
Mol. Mass.:
437.515
SMILES:
Cn1c(SCC(=O)N2CCOCC2)nnc1-c1cccc(NC(=O)c2ccccc2)c1
: