Target
Eukaryotic translation initiation factor 4H
Ligand
BDBM61275
Substrate
Meas. Tech.
uHTS fluorescence polarization assay for the identification of translation initiation inhibitors (eIF4H)
IC50
15660±n/a nM
Citation
 PubChem, PC uHTS fluorescence polarization assay for the identification of translation initiation inhibitors (eIF4H) PubChem Bioassay (2009)[AID] 
Target
Name:
Eukaryotic translation initiation factor 4H
Synonyms:
EIF4H KIAA0038 WSCR1
Type:
Enzyme Catalytic Domain
Mol. Mass.:
27385.24
Organism:
Homo sapiens (Human)
Description:
Q15056
Residue:
248
  
Inhibitor
Name:
BDBM61275
Synonyms:
MLS000109085 N-(2-furfuryl)-9H-xanthene-9-carboxamide SMR000105031 | cid_742991
Type:
Small organic molecule
Emp. Form.:
C19H15NO3
Mol. Mass.:
305.3273
SMILES:
O=C(NCc1ccco1)C1c2ccccc2Oc2ccccc12
: